BDBM50199408 CHEMBL3901536
SMILES NC(=N)NCCCCC(=O)Nc1ccc(C[C@H](NC(=O)[C@@H]2CCCN2S(=O)(=O)c2cccnc2)C(O)=O)cc1
InChI Key InChIKey=MTQOSHJOLBRZIV-SFTDATJTSA-N
Data  2 IC50
  Tab Delimited (TSV)   2D SDfile   Computed 3D by Vconf -m prep SDfile
Find this compound or compounds like it in BindingDB:
Activity Spreadsheet -- Enzyme Inhibition Constant Data from BindingDB
Found 2 hits for monomerid = 50199408
TargetIntegrin alpha-V/beta-1(Homo sapiens (Human))
University Of California San Francisco
Curated by ChEMBL
LigandPNGBDBM50199408(CHEMBL3901536)
Affinity DataIC50:  32nM. Assay description: Inhibition of integrin alphaVbeta1 (unknown origin)-mediated CHO cell adhesion to fibronectin preincubated for 15 to 30 mins followed by 60 min incub...
In DepthDetails ArticlePubMed
TargetIntegrin alpha-V/beta-1(Homo sapiens (Human))
University Of California San Francisco
Curated by ChEMBL
LigandPNGBDBM50199408(CHEMBL3901536)
Affinity DataIC50:  32nM. Assay description: Inhibition of integrin alphaVbeta1 (unknown origin)-mediated CHO cell adhesion to fibronectin preincubated for 15 to 30 mins followed by 60 min incub...
In DepthDetails ArticlePubMed