BDBM50199766 CHEMBL394351::N-((S,Z)-1-((S)-1-((3S)-2-hydroxy-5-oxo-tetrahydrofuran-3-ylamino)-1-oxopropan-2-yl)-2-oxo-2,3,4,7-tetrahydro-1H-azepin-3-yl)-2-naphthamide
SMILES C[C@H](N1CC=CC[C@H](NC(=O)c2ccc3ccccc3c2)C1=O)C(=O)N[C@H]1CC(=O)OC1O
InChI Key InChIKey=CBORVVSGKICHTH-PKTPTRIFSA-N
Data  3 IC50
  Tab Delimited (TSV)   2D SDfile   Computed 3D by Vconf -m prep SDfile
Find this compound or compounds like it in BindingDB:
Activity Spreadsheet -- Enzyme Inhibition Constant Data from BindingDB
Found 3 hits for monomerid = 50199766
TargetCaspase-8(Homo sapiens (Human))
Procter & Gamble Pharmaceuticals
Curated by ChEMBL
LigandPNGBDBM50199766(CHEMBL394351 | N-((S,Z)-1-((S)-1-((3S)-2-hydroxy-5...)
Affinity DataIC50:  162nM. Assay description: Inhibition of caspase 8
In DepthDetails ArticlePubMed
TargetCaspase-1(Homo sapiens (Human))
Procter & Gamble Pharmaceuticals
Curated by ChEMBL
LigandPNGBDBM50199766(CHEMBL394351 | N-((S,Z)-1-((S)-1-((3S)-2-hydroxy-5...)
Affinity DataIC50:  1nM. Assay description: Inhibition of ICE
In DepthDetails ArticlePubMed
TargetCaspase-3(Homo sapiens (Human))
Procter & Gamble Pharmaceuticals
Curated by ChEMBL
LigandPNGBDBM50199766(CHEMBL394351 | N-((S,Z)-1-((S)-1-((3S)-2-hydroxy-5...)
Affinity DataIC50:  7.51E+3nM. Assay description: Inhibition of caspase 3
In DepthDetails ArticlePubMed