BDBM50199881 CHEMBL3962478
SMILES COc1ccc(Nc2ncc3ncn(-c4cccc(NC(=O)C=C)c4)c3n2)cc1
InChI Key InChIKey=HEVQGERSWVXART-UHFFFAOYSA-N
Data  2 IC50
  Tab Delimited (TSV)   2D SDfile   Computed 3D by Vconf -m prep SDfile
Find this compound or compounds like it in BindingDB:
Activity Spreadsheet -- Enzyme Inhibition Constant Data from BindingDB
Found 2 hits for monomerid = 50199881
TargetTyrosine-protein kinase BTK(Homo sapiens (Human))
Dalian Medical University
Curated by ChEMBL
LigandPNGBDBM50199881(CHEMBL3962478)
Affinity DataIC50:  97nM. Assay description: Inhibition of recombinant human N-terminal His-tagged BTK expressed in baculovirus infected sf9 cells using poly(4:1 Glu,Tyr) as substrate by ADP-Glo...
In DepthDetails ArticlePubMed
TargetTyrosine-protein kinase JAK3(Homo sapiens (Human))
Dalian Medical University
Curated by ChEMBL
LigandPNGBDBM50199881(CHEMBL3962478)
Affinity DataIC50:  67nM. Assay description: Inhibition of JAK3 (unknown origin)
In DepthDetails ArticlePubMed