BDBM50199993 (1S,3S)-(Z)-3-amino-4-(2,2,2-trifluoroethylidene)cyclopentane carboxylic::CHEMBL219479
SMILES N[C@H]1C[C@H](C\C1=C\C(F)(F)F)C(O)=O
InChI Key InChIKey=ASCYDOBPGRSYPH-WREUKLMHSA-N
Data  1 KI
  Tab Delimited (TSV)   2D SDfile   Computed 3D by Vconf -m prep SDfile
Find this compound or compounds like it in BindingDB:
Activity Spreadsheet -- Enzyme Inhibition Constant Data from BindingDB
Found 1 hit for monomerid = 50199993
Target4-aminobutyrate aminotransferase, mitochondrial(Sus scrofa)
Northwestern University
Curated by ChEMBL
LigandPNGBDBM50199993((1S,3S)-(Z)-3-amino-4-(2,2,2-trifluoroethylidene)c...)
Affinity DataKi:  7.74E+6nM. Assay description: Inhibition of pig brain GABA-AT in presence of beta-mercaptoethanol
In DepthDetails ArticlePubMed