BDBM50200117 CHEMBL3969655
SMILES ICC(=O)Nc1ccc(cc1)N=[N+]=[N-]
InChI Key InChIKey=YDRFOMLULPHOBA-UHFFFAOYSA-N
Data  1 IC50
  Tab Delimited (TSV)   2D SDfile   Computed 3D by Vconf -m prep SDfile
Find this compound or compounds like it in BindingDB:
Activity Spreadsheet -- Enzyme Inhibition Constant Data from BindingDB
Found 1 hit for monomerid = 50200117
TargetUDP-N-acetylglucosamine--peptide N-acetylglucosaminyltransferase 110 kDa subunit(Homo sapiens (Human))
University Of Chinese Academy Of Sciences
Curated by ChEMBL
LigandPNGBDBM50200117(CHEMBL3969655)
Affinity DataIC50:  8.65E+5nM. Assay description: Inhibition of OGT (unknown origin) assessed as reduction in GlcNAc transfer to CKII peptide incubated for 60 mins by HPLC method
In DepthDetails ArticlePubMed