BDBM50200322 2beta-carbomethoxy-3beta-(3'-((Z)-2-iodoethenyl)phenyl)nortropane::CHEMBL216736
SMILES COC(=O)[C@@H]1C2CCC(C[C@@H]1c1cccc(\C=C\I)c1)N2
InChI Key InChIKey=AHEMMEONOCHONP-DBUDALRPSA-N
Data  3 KI
  Tab Delimited (TSV)   2D SDfile   Computed 3D by Vconf -m prep SDfile
Find this compound or compounds like it in BindingDB:
Activity Spreadsheet -- Enzyme Inhibition Constant Data from BindingDB
Found 3 hits for monomerid = 50200322
TargetSodium-dependent serotonin transporter(Homo sapiens (Human))
Emory University
Curated by ChEMBL
LigandPNGBDBM50200322(2beta-carbomethoxy-3beta-(3'-((Z)-2-iodoethenyl)ph...)
Affinity DataKi:  0.200nM. Assay description: Displacement of [3H]citalopram from human SERT
In DepthDetails ArticlePubMed
TargetSodium-dependent dopamine transporter(Homo sapiens (Human))
Emory University
Curated by ChEMBL
LigandPNGBDBM50200322(2beta-carbomethoxy-3beta-(3'-((Z)-2-iodoethenyl)ph...)
Affinity DataKi:  29.9nM. Assay description: Displacement of [3H]RTI-55 from human DAT
In DepthDetails ArticlePubMed
TargetSodium-dependent noradrenaline transporter(Homo sapiens (Human))
Emory University
Curated by ChEMBL
LigandPNGBDBM50200322(2beta-carbomethoxy-3beta-(3'-((Z)-2-iodoethenyl)ph...)
Affinity DataKi:  102nM. Assay description: Displacement of [3H]nisoxetine from human NET
In DepthDetails ArticlePubMed