BDBM50200480 CHEMBL3965352
SMILES [H][C@]1(CC[C@@H](C)c2ccc(C)nc12)[C@@H](C)C(=O)Nc1ccc(Cl)c(c1)-c1nc2ccccc2n1C
InChI Key InChIKey=JMXYJARAWTZWPL-BLIXFSHQSA-N
Data  2 IC50  3 EC50
  Tab Delimited (TSV)   2D SDfile   Computed 3D by Vconf -m prep SDfile
Find this compound or compounds like it in BindingDB:
Activity Spreadsheet -- Enzyme Inhibition Constant Data from BindingDB
Found 5 hits for monomerid = 50200480
TargetSmoothened homolog(Mus musculus)
University Of Chinese Academy Of Sciences
Curated by ChEMBL
LigandPNGBDBM50200480(CHEMBL3965352)
Affinity DataEC50:  24nM. Assay description: Inhibition of Smo in mouse Shh Light2 cells assessed as inhibition of SAG-induced Hh pathway activity by measuring SAG-EC50 at 50 nM measured after 3...
In DepthDetails ArticlePubMed
TargetSmoothened homolog(Mus musculus)
University Of Chinese Academy Of Sciences
Curated by ChEMBL
LigandPNGBDBM50200480(CHEMBL3965352)
Affinity DataEC50:  47nM. Assay description: Inhibition of Smo in mouse Shh Light2 cells assessed as inhibition of SAG-induced Hh pathway activity by measuring SAG-EC50 at 100 nM measured after ...
In DepthDetails ArticlePubMed
TargetSmoothened homolog(Mus musculus)
University Of Chinese Academy Of Sciences
Curated by ChEMBL
LigandPNGBDBM50200480(CHEMBL3965352)
Affinity DataIC50:  9.5nM. Assay description: Inhibition of Smo-mediated Hh signalling pathway in mouse Shh Light2 cells by Gli-luciferase reporter gene assay
In DepthDetails ArticlePubMed
TargetSmoothened homolog(Mus musculus)
University Of Chinese Academy Of Sciences
Curated by ChEMBL
LigandPNGBDBM50200480(CHEMBL3965352)
Affinity DataEC50:  137nM. Assay description: Inhibition of Smo in mouse Shh Light2 cells assessed as inhibition of SAG-induced Hh pathway activity by measuring SAG-EC50 at 500 nM measured after ...
In DepthDetails ArticlePubMed
TargetPotassium voltage-gated channel subfamily H member 2(Homo sapiens (Human))
University Of Chinese Academy Of Sciences
Curated by ChEMBL
LigandPNGBDBM50200480(CHEMBL3965352)
Affinity DataIC50: >1.50E+4nM. Assay description: Inhibition of human ERG
In DepthDetails ArticlePubMed