BDBM50200572 CHEMBL3889955
SMILES C[C@H](NC(=O)CCc1nc2cccnc2n1Cc1ccc(cc1)C(F)(F)F)c1ccc(Cl)cc1
InChI Key InChIKey=QCPLKLWIHLHYHO-INIZCTEOSA-N
Data  2 IC50
  Tab Delimited (TSV)   2D SDfile   Computed 3D by Vconf -m prep SDfile
Find this compound or compounds like it in BindingDB:
Activity Spreadsheet -- Enzyme Inhibition Constant Data from BindingDB
Found 2 hits for monomerid = 50200572
TargetEctonucleotide pyrophosphatase/phosphodiesterase family member 2(Homo sapiens (Human))
Babraham Research Campus
Curated by ChEMBL
LigandPNGBDBM50200572(CHEMBL3889955)
Affinity DataIC50:  16nM. Assay description: Inhibition of ATX in human plasma assessed as decrease in hydrolysis of lysophosphatidylcholine by measuring choline release after 24 hrs by horserad...
In DepthDetails ArticlePubMed
TargetEctonucleotide pyrophosphatase/phosphodiesterase family member 2(Homo sapiens (Human))
Babraham Research Campus
Curated by ChEMBL
LigandPNGBDBM50200572(CHEMBL3889955)
Affinity DataIC50:  2nM. Assay description: Inhibition of human recombinant ATX using Rac-1-Palmitoyl-glycero-3-phosphocholine as substrate incubated for 2 hrs using ADHP fluorogenic peroxidase...
In DepthDetails ArticlePubMed