BDBM50200736 (R)-1-(2-(N-methylacetamido)acetyl)pyrrolidin-2-ylboronic acid::CHEMBL217754
SMILES CN(CC(=O)N1CCC[C@H]1B(O)O)C(C)=O
InChI Key InChIKey=RORVKNCKCFHQRE-QMMMGPOBSA-N
Data  3 KI
  Tab Delimited (TSV)   2D SDfile   Computed 3D by Vconf -m prep SDfile
Find this compound or compounds like it in BindingDB:
Activity Spreadsheet -- Enzyme Inhibition Constant Data from BindingDB
Found 3 hits for monomerid = 50200736
TargetProlyl endopeptidase(Homo sapiens (Human))
Genentech
Curated by ChEMBL
LigandPNGBDBM50200736((R)-1-(2-(N-methylacetamido)acetyl)pyrrolidin-2-yl...)
Affinity DataKi:  53nM. Assay description: Inhibitory constant against POP
In DepthDetails ArticlePubMed
TargetProlyl endopeptidase FAP(Homo sapiens (Human))
Genentech
Curated by ChEMBL
LigandPNGBDBM50200736((R)-1-(2-(N-methylacetamido)acetyl)pyrrolidin-2-yl...)
Affinity DataKi:  161nM. Assay description: Inhibitiory constant against FAP
In DepthDetails ArticlePubMed
TargetDipeptidyl peptidase 4(Homo sapiens (Human))
Genentech
Curated by ChEMBL
LigandPNGBDBM50200736((R)-1-(2-(N-methylacetamido)acetyl)pyrrolidin-2-yl...)
Affinity DataKi:  4.60E+3nM. Assay description: Inhibition constant against DPP-4
In DepthDetails ArticlePubMed