BDBM50200788 2-(4-chlorophenoxy)-N-(4-methyl-2-(pyrrolidin-1-yl)quinazolin-6-yl)acetamide::ADS-103253::CHEMBL216228
SMILES Cc1nc(nc2ccc(NC(=O)COc3ccc(Cl)cc3)cc12)N1CCCC1
InChI Key InChIKey=MXDQNCXNQJMIEH-UHFFFAOYSA-N
Data  5 IC50
  Tab Delimited (TSV)   2D SDfile   Computed 3D by Vconf -m prep SDfile
Find this compound or compounds like it in BindingDB:
Activity Spreadsheet -- Enzyme Inhibition Constant Data from BindingDB
Found 5 hits for monomerid = 50200788
TargetMelanin-concentrating hormone receptor 1(Homo sapiens (Human))
Argenta Discovery
Curated by ChEMBL
LigandPNGBDBM50200788(2-(4-chlorophenoxy)-N-(4-methyl-2-(pyrrolidin-1-yl...)
Affinity DataIC50:  58nM. Assay description: Inhibition of MCH-mediated calcium influx into MCH-R1 expressing cells
In DepthDetails ArticlePubMed
TargetMelanin-concentrating hormone receptor 1(Homo sapiens (Human))
Argenta Discovery
Curated by ChEMBL
LigandPNGBDBM50200788(2-(4-chlorophenoxy)-N-(4-methyl-2-(pyrrolidin-1-yl...)
Affinity DataIC50:  250nM. Assay description: Displacement of 125I-[Phe13,Tyr19]-MCH from MCH-R1 expressing cell membranes
In DepthDetails ArticlePubMed
Target5-hydroxytryptamine receptor 2B(Homo sapiens (Human))
Argenta Discovery
Curated by ChEMBL
LigandPNGBDBM50200788(2-(4-chlorophenoxy)-N-(4-methyl-2-(pyrrolidin-1-yl...)
Affinity DataIC50:  1.90E+3nM. Assay description: Inhibition of 5HT2B
In DepthDetails ArticlePubMed
TargetD(2) dopamine receptor(Homo sapiens (Human))
Argenta Discovery
Curated by ChEMBL
LigandPNGBDBM50200788(2-(4-chlorophenoxy)-N-(4-methyl-2-(pyrrolidin-1-yl...)
Affinity DataIC50: >1.00E+5nM. Assay description: Inhibition of D2(L)
In DepthDetails ArticlePubMed
TargetPotassium voltage-gated channel subfamily H member 2(Homo sapiens (Human))
Argenta Discovery
Curated by ChEMBL
LigandPNGBDBM50200788(2-(4-chlorophenoxy)-N-(4-methyl-2-(pyrrolidin-1-yl...)
Affinity DataIC50:  1.00E+4nM. Assay description: Inhibition of hERG in patch-clamp assay
In DepthDetails ArticlePubMed