BDBM50201068 (1S,6R)-5-(3,8-Diaza-bicyclo[4.2.0]oct-8-yl)-nicotinonitrile::CHEMBL426879
SMILES N#Cc1cncc(c1)N1C[C@H]2CCNC[C@@H]12
InChI Key InChIKey=YKOUMOZMCMIKMG-ZYHUDNBSSA-N
Data  3 EC50
  Tab Delimited (TSV)   2D SDfile   Computed 3D by Vconf -m prep SDfile
Find this compound or compounds like it in BindingDB:
Activity Spreadsheet -- Enzyme Inhibition Constant Data from BindingDB
Found 3 hits for monomerid = 50201068
TargetNeuronal acetylcholine receptor subunit alpha-3(Homo sapiens (Human))
Burnham Institute For Medical Research
Curated by ChEMBL
LigandPNGBDBM50201068((1S,6R)-5-(3,8-Diaza-bicyclo[4.2.0]oct-8-yl)-nicot...)
Affinity DataEC50:  5.62E+3nM. Assay description: Agonist activity against human alpha3beta4 nAChR
In DepthDetails ArticlePubMed
TargetNeuronal acetylcholine receptor subunit alpha-4(Homo sapiens (Human))
Burnham Institute For Medical Research
Curated by ChEMBL
LigandPNGBDBM50201068((1S,6R)-5-(3,8-Diaza-bicyclo[4.2.0]oct-8-yl)-nicot...)
Affinity DataEC50:  1.95E+3nM. Assay description: Agonist activity against human alpha4beta2 nAChR
In DepthDetails ArticlePubMed
TargetNeuronal acetylcholine receptor subunit alpha-4/beta-2(Homo sapiens (Human))
Abbott Laboratories
Curated by ChEMBL
LigandPNGBDBM50201068((1S,6R)-5-(3,8-Diaza-bicyclo[4.2.0]oct-8-yl)-nicot...)
Affinity DataEC50:  1.93E+3nM. Assay description: Agonist activity at human alpha4beta2 ACHR expressed in HEK293 cells assessed as change in intracellular calcium concentration by FLIPR
In DepthDetails ArticlePubMed