BDBM50201274 CHEMBL215661::N-(1-(6-acetamido-2,3-dihydro-1H-inden-1-yl)piperidin-4-yl)-7-fluoro-4-oxo-4H-chromene-2-carboxamide
SMILES CC(=O)Nc1ccc2CCC(N3CCC(CC3)NC(=O)c3cc(=O)c4ccc(F)cc4o3)c2c1
InChI Key InChIKey=PHWDAICGTWFRGW-UHFFFAOYSA-N
Data  4 IC50
  Tab Delimited (TSV)   2D SDfile   Computed 3D by Vconf -m prep SDfile
Find this compound or compounds like it in BindingDB:
Activity Spreadsheet -- Enzyme Inhibition Constant Data from BindingDB
Found 4 hits for monomerid = 50201274
TargetMelanin-concentrating hormone receptor 1(Homo sapiens (Human))
Abbott Laboratories
Curated by ChEMBL
LigandPNGBDBM50201274(CHEMBL215661 | N-(1-(6-acetamido-2,3-dihydro-1H-in...)
Affinity DataIC50:  3nM. Assay description: Displacement of 125I-MCH from MCH-R1 expressed in IMR-32 cells
In DepthDetails ArticlePubMed
TargetPotassium voltage-gated channel subfamily H member 2(Homo sapiens (Human))
Abbott Laboratories
Curated by ChEMBL
LigandPNGBDBM50201274(CHEMBL215661 | N-(1-(6-acetamido-2,3-dihydro-1H-in...)
Affinity DataIC50:  2.72E+4nM. Assay description: Displacement of 3H-dofetilide from hERG-expressing HEK membrane homogenates
In DepthDetails ArticlePubMed
TargetMelanin-concentrating hormone receptor 1(Homo sapiens (Human))
Abbott Laboratories
Curated by ChEMBL
LigandPNGBDBM50201274(CHEMBL215661 | N-(1-(6-acetamido-2,3-dihydro-1H-in...)
Affinity DataIC50:  3nM. Assay description: Displacement of 125I-MCH from MCH-R1 expressed in IMR-32 cells
In DepthDetails ArticlePubMed
TargetPotassium voltage-gated channel subfamily H member 2(Homo sapiens (Human))
Abbott Laboratories
Curated by ChEMBL
LigandPNGBDBM50201274(CHEMBL215661 | N-(1-(6-acetamido-2,3-dihydro-1H-in...)
Affinity DataIC50:  2.72E+4nM. Assay description: Displacement of 3H-dofetilide from hERG-expressing HEK membrane homogenates
In DepthDetails ArticlePubMed