BDBM50201610 CHEMBL3916793
SMILES OC(=O)c1cccnc1Nc1ccc(F)cc1
InChI Key InChIKey=CUEJKLHNOMZKTP-UHFFFAOYSA-N
Data  1 IC50
  Tab Delimited (TSV)   2D SDfile   Computed 3D by Vconf -m prep SDfile
Find this compound or compounds like it in BindingDB:
Activity Spreadsheet -- Enzyme Inhibition Constant Data from BindingDB
Found 1 hit for monomerid = 50201610
TargetDihydroorotate dehydrogenase (quinone), mitochondrial(Homo sapiens (Human))
Broad Institute
Curated by ChEMBL
LigandPNGBDBM50201610(CHEMBL3916793)
Affinity DataIC50:  2.80E+3nM. Assay description: Inhibition of human recombinant DHODH
In DepthDetails ArticlePubMed