BDBM50201637 CHEMBL3952460
SMILES Clc1ccc(cc1)C(=O)NCC(=O)N[C@@H]1CCCc2ccccc12
InChI Key InChIKey=LVJDAFCIPXALGI-QGZVFWFLSA-N
Data  1 IC50
  Tab Delimited (TSV)   2D SDfile   Computed 3D by Vconf -m prep SDfile
Find this compound or compounds like it in BindingDB:
Activity Spreadsheet -- Enzyme Inhibition Constant Data from BindingDB
Found 1 hit for monomerid = 50201637
TargetDihydroorotate dehydrogenase (quinone), mitochondrial(Homo sapiens (Human))
Broad Institute
Curated by ChEMBL
LigandPNGBDBM50201637(CHEMBL3952460)
Affinity DataIC50: >2.00E+4nM. Assay description: Inhibition of human recombinant DHODH
In DepthDetails ArticlePubMed