BDBM50201673 2-methyl-6-(2-(pyridin-4-yl)ethynyl)pyridine::CHEMBL394923
SMILES Cc1cccc(n1)C#Cc1ccncc1
InChI Key InChIKey=FXCZYSFKYHNDJL-UHFFFAOYSA-N
Data  2 IC50
  Tab Delimited (TSV)   2D SDfile   Computed 3D by Vconf -m prep SDfile
Find this compound or compounds like it in BindingDB:
Activity Spreadsheet -- Enzyme Inhibition Constant Data from BindingDB
Found 2 hits for monomerid = 50201673
TargetMetabotropic glutamate receptor 5(Homo sapiens (Human))
F. Hoffmann-La Roche
Curated by ChEMBL
LigandPNGBDBM50201673(2-methyl-6-(2-(pyridin-4-yl)ethynyl)pyridine | CHE...)
Affinity DataIC50:  213nM. Assay description: Antagonist activity at mGluR5 by FLIPR
In DepthDetails ArticlePubMed
TargetMetabotropic glutamate receptor 5(Homo sapiens (Human))
F. Hoffmann-La Roche
Curated by ChEMBL
LigandPNGBDBM50201673(2-methyl-6-(2-(pyridin-4-yl)ethynyl)pyridine | CHE...)
Affinity DataIC50:  26nM. Assay description: Displacement of [3H]MPEP from mGlu5 receptor
In DepthDetails ArticlePubMed