BDBM50201678 CHEMBL3896509
SMILES CC#C[C@@H](CC(O)=O)c1ccc(OCc2cccc(CN(Cc3ccsc3)Cc3ccncc3)c2)cc1
InChI Key InChIKey=TVBXJJUHFFSBLP-LJAQVGFWSA-N
Data  1 EC50
  Tab Delimited (TSV)   2D SDfile   Computed 3D by Vconf -m prep SDfile
Find this compound or compounds like it in BindingDB:
Activity Spreadsheet -- Enzyme Inhibition Constant Data from BindingDB
Found 1 hit for monomerid = 50201678
TargetFree fatty acid receptor 1(Homo sapiens (Human))
Cadila Healthcare
Curated by ChEMBL
LigandPNGBDBM50201678(CHEMBL3896509)
Affinity DataEC50:  1.90nM. Assay description: Agonist activity at human GPR40 expressed in HEK293 cells measured after 18 to 20 hrs by beta-gal based luciferase reporter gene assay
In DepthDetails ArticlePubMed