BDBM50201718 CHEMBL3925929
SMILES Nc1ccc2CCC(Cc2c1)n1nc(-c2cc(F)c3OCCNc3c2)c2c(N)ncnc12
InChI Key InChIKey=UZGODYPLGUGUMS-UHFFFAOYSA-N
Data  4 IC50
  Tab Delimited (TSV)   2D SDfile   Computed 3D by Vconf -m prep SDfile
Find this compound or compounds like it in BindingDB:
Activity Spreadsheet -- Enzyme Inhibition Constant Data from BindingDB
Found 4 hits for monomerid = 50201718
LigandPNGBDBM50201718(CHEMBL3925929)
Affinity DataIC50:  55nM. Assay description: Inhibition of PI3Kdelta (unknown origin) using biotinylated PIP2 as substrate in presence of streptavidin-APC by FRET assay
In DepthDetails ArticlePubMed
TargetTyrosine-protein kinase BTK(Homo sapiens (Human))
TBA
Curated by ChEMBL
LigandPNGBDBM50201718(CHEMBL3925929)
Affinity DataIC50:  176nM. Assay description: Inhibition of human BTK using KVEKIGEGTYGVVYK as substrate after 20 mins by [gamma-33P]ATP based assay
In DepthDetails ArticlePubMed
LigandPNGBDBM50201718(CHEMBL3925929)
Affinity DataIC50:  55nM. Assay description: Inhibition of PI3Kdelta (unknown origin) using biotinylated PIP2 as substrate in presence of streptavidin-APC by FRET assay
In DepthDetails ArticlePubMed
TargetTyrosine-protein kinase BTK(Homo sapiens (Human))
TBA
Curated by ChEMBL
LigandPNGBDBM50201718(CHEMBL3925929)
Affinity DataIC50:  176nM. Assay description: Inhibition of human BTK using KVEKIGEGTYGVVYK as substrate after 20 mins by [gamma-33P]ATP based assay
In DepthDetails ArticlePubMed