BDBM50201729 CHEMBL3923573
SMILES Nc1ncnc2n(nc(-c3ccc(Cl)c(O)c3)c12)C1Cc2ccccc2C1
InChI Key InChIKey=GNTTXPGBWWTVGP-UHFFFAOYSA-N
Data  2 IC50
  Tab Delimited (TSV)   2D SDfile   Computed 3D by Vconf -m prep SDfile
Find this compound or compounds like it in BindingDB:
Activity Spreadsheet -- Enzyme Inhibition Constant Data from BindingDB
Found 2 hits for monomerid = 50201729
TargetTyrosine-protein kinase BTK(Homo sapiens (Human))
TBA
Curated by ChEMBL
LigandPNGBDBM50201729(CHEMBL3923573)
Affinity DataIC50:  14nM. Assay description: Inhibition of human BTK using KVEKIGEGTYGVVYK as substrate after 20 mins by [gamma-33P]ATP based assay
In DepthDetails ArticlePubMed
LigandPNGBDBM50201729(CHEMBL3923573)
Affinity DataIC50:  33nM. Assay description: Inhibition of PI3Kdelta (unknown origin) using biotinylated PIP2 as substrate in presence of streptavidin-APC by FRET assay
In DepthDetails ArticlePubMed