BDBM50201794 CHEMBL3897445
SMILES CC(C)[C@H](NC(=O)[C@H](CO)NC(=O)NCCCCNC(N)=N)C(=O)N[C@H]1CCCN(C1O)C(N)=N
InChI Key InChIKey=LWCQPGWFMIZITF-OBXHSSLNSA-N
Data  1 KI
  Tab Delimited (TSV)   2D SDfile   Computed 3D by Vconf -m prep SDfile
Find this compound or compounds like it in BindingDB:
Activity Spreadsheet -- Enzyme Inhibition Constant Data from BindingDB
Found 1 hit for monomerid = 50201794
TargetCathepsin K(Homo sapiens (Human))
University Of British Columbia
Curated by ChEMBL
LigandPNGBDBM50201794(CHEMBL3897445)
Affinity DataKi:  11nM. Assay description: Competitive inhibition of human recombinant cathepsin K using Z-FR-MCA fluorogenic substrate by Handerson plot analysis
In DepthDetails ArticlePubMed