BDBM50202248 CHEMBL3919472
SMILES COc1ccc2[nH]cc(CCNC(=O)C(NC(=O)c3cc(=O)c4c(OCc5ccc(Br)cc5)cccc4o3)C(C)C)c2c1
InChI Key InChIKey=VDBZJURPOQEABU-UHFFFAOYSA-N
Data  1 EC50
  Tab Delimited (TSV)   2D SDfile   Computed 3D by Vconf -m prep SDfile
Find this compound or compounds like it in BindingDB:
Activity Spreadsheet -- Enzyme Inhibition Constant Data from BindingDB
Found 1 hit for monomerid = 50202248
TargetBroad substrate specificity ATP-binding cassette transporter ABCG2(Homo sapiens (Human))
Universit£
Curated by ChEMBL
LigandPNGBDBM50202248(CHEMBL3919472)
Affinity DataEC50:  340nM. Assay description: Inhibition of ABCG2 (unknown origin) expressed in HEK293 cells assessed as reduction in mitoxantrone efflux after 30 mins by flow cytometric analysis
In DepthDetails ArticlePubMed