BDBM50202306 CHEMBL3912187
SMILES CS(=O)(=O)c1ccc(CC(=O)N\N=C2/C(=O)Nc3ccccc23)cc1
InChI Key InChIKey=YTJAMSGDUFBDQA-UHFFFAOYSA-N
Data  1 IC50
  Tab Delimited (TSV)   2D SDfile   Computed 3D by Vconf -m prep SDfile
Find this compound or compounds like it in BindingDB:
Activity Spreadsheet -- Enzyme Inhibition Constant Data from BindingDB
Found 1 hit for monomerid = 50202306
TargetHepatocyte growth factor receptor(Homo sapiens (Human))
Egyptian Russian University
Curated by ChEMBL
LigandPNGBDBM50202306(CHEMBL3912187)
Affinity DataIC50: >2.00E+4nM. Assay description: Inhibition of GST-tagged c-Met (unknown origin) assessed as phosphotyrosine levels preincubated foe 15 mins followed by addition of poly(glutamic aci...
In DepthDetails ArticlePubMed