BDBM50202342 CHEMBL218864::cyclo(-D-Tyr-D-Arg-L-Arg-L-Nal-D-Pic-)
SMILES [#7]\[#6](-[#7])=[#7]\[#6]-[#6]-[#6]-[#6@H]-1-[#7]-[#6](=O)-[#6@H](-[#6]-[#6]-[#6]\[#7]=[#6](\[#7])-[#7])-[#7]-[#6](=O)-[#6@H](-[#6]-c2ccc3ccccc3c2)-[#7]-[#6](=O)-[#6@H]-2-[#6]-[#6]-[#6]-[#6]-[#7]-2-[#6](=O)-[#6@@H](-[#6]-c2ccc(-[#8])cc2)-[#7]-[#6]-1=O
InChI Key InChIKey=OGLLNRFCXLYAMK-RGPGAZMKSA-N
Data  1 IC50
  Tab Delimited (TSV)   2D SDfile   Computed 3D by Vconf -m prep SDfile
Find this compound or compounds like it in BindingDB:
Activity Spreadsheet -- Enzyme Inhibition Constant Data from BindingDB
Found 1 hit for monomerid = 50202342
TargetC-X-C chemokine receptor type 4(Homo sapiens (Human))
Kyoto University
Curated by ChEMBL
LigandPNGBDBM50202342(CHEMBL218864 | cyclo(-D-Tyr-D-Arg-L-Arg-L-Nal-D-Pi...)
Affinity DataIC50: >1.00E+3nM. Assay description: Inhibition of [125I]SDF1 binding to CXCR4 transfected in CHO cells
In DepthDetails ArticlePubMed