BDBM50202450 CHEMBL3263907
SMILES Oc1cc2O\C(=C/c3cn(Cc4ccccc4)c4ccccc34)C(=O)c2c(O)c1
InChI Key InChIKey=ODKHXTFNHWFZMP-YVNNLAQVSA-N
Data  1 IC50
  Tab Delimited (TSV)   2D SDfile   Computed 3D by Vconf -m prep SDfile
Find this compound or compounds like it in BindingDB:
Activity Spreadsheet -- Enzyme Inhibition Constant Data from BindingDB
Found 1 hit for monomerid = 50202450
TargetATP-binding cassette sub-family C member 2(Homo sapiens (Human))
Bmssi Umr 5086 Cnrs/Universit£
Curated by ChEMBL
LigandPNGBDBM50202450(CHEMBL3263907)
Affinity DataIC50:  1.22E+4nM. Assay description: Inhibition of ABCC2 (unknown origin) expressed in MDCK2 cells assessed as inhibition of calcein-AM efflux measured after 30 mins in presence of ABCB1...
In DepthDetails ArticlePubMed