BDBM50202681 7-fluoro-4-oxo-N-(1-((2-oxo-2H-chromen-7-yl)methyl)piperidin-4-yl)-4H-chromene-2-carboxamide::CHEMBL386281
SMILES Fc1ccc2c(c1)oc(cc2=O)C(=O)NC1CCN(Cc2ccc3ccc(=O)oc3c2)CC1
InChI Key InChIKey=OKJKIOJUDZFVDL-UHFFFAOYSA-N
Data  2 IC50
  Tab Delimited (TSV)   2D SDfile   Computed 3D by Vconf -m prep SDfile
Find this compound or compounds like it in BindingDB:
Activity Spreadsheet -- Enzyme Inhibition Constant Data from BindingDB
Found 2 hits for monomerid = 50202681
TargetPotassium voltage-gated channel subfamily H member 2(Homo sapiens (Human))
Abbott Laboratories
Curated by ChEMBL
LigandPNGBDBM50202681(7-fluoro-4-oxo-N-(1-((2-oxo-2H-chromen-7-yl)methyl...)
Affinity DataIC50:  5.11E+4nM. Assay description: Displacement of 3H-dofetilide from hERG-expressing HEK membrane homogenates
In DepthDetails ArticlePubMed
TargetMelanin-concentrating hormone receptor 1(Homo sapiens (Human))
Abbott Laboratories
Curated by ChEMBL
LigandPNGBDBM50202681(7-fluoro-4-oxo-N-(1-((2-oxo-2H-chromen-7-yl)methyl...)
Affinity DataIC50:  1nM. Assay description: Displacement of 125I-MCH from MCH-R1 expressed in IMR-32 cells
In DepthDetails ArticlePubMed