BDBM50202683 CHEMBL216524::N-(1-(benzo[d]oxazol-6-ylmethyl)piperidin-4-yl)-7-fluoro-4-oxo-4H-chromene-2-carboxamide
SMILES Fc1ccc2c(c1)oc(cc2=O)C(=O)NC1CCN(Cc2ccc3ncoc3c2)CC1
InChI Key InChIKey=OCMCRRBEHXHBIV-UHFFFAOYSA-N
Data  2 IC50
  Tab Delimited (TSV)   2D SDfile   Computed 3D by Vconf -m prep SDfile
Find this compound or compounds like it in BindingDB:
Activity Spreadsheet -- Enzyme Inhibition Constant Data from BindingDB
Found 2 hits for monomerid = 50202683
TargetPotassium voltage-gated channel subfamily H member 2(Homo sapiens (Human))
Abbott Laboratories
Curated by ChEMBL
LigandPNGBDBM50202683(CHEMBL216524 | N-(1-(benzo[d]oxazol-6-ylmethyl)pip...)
Affinity DataIC50:  3.46E+4nM. Assay description: Displacement of 3H-dofetilide from hERG-expressing HEK membrane homogenates
In DepthDetails ArticlePubMed
TargetMelanin-concentrating hormone receptor 1(Homo sapiens (Human))
Abbott Laboratories
Curated by ChEMBL
LigandPNGBDBM50202683(CHEMBL216524 | N-(1-(benzo[d]oxazol-6-ylmethyl)pip...)
Affinity DataIC50:  10nM. Assay description: Displacement of 125I-MCH from MCH-R1 expressed in IMR-32 cells
In DepthDetails ArticlePubMed