BDBM50202809 CHEMBL247462::N-(cyclopropylmethyl)-N-propyl-4-(2,2,2-trifluoroacetyl)benzamide
SMILES CCCN(CC1CC1)C(=O)c1ccc(cc1)C(=O)C(F)(F)F
InChI Key InChIKey=JZRJOABRXYRESQ-UHFFFAOYSA-N
Data  1 IC50
  Tab Delimited (TSV)   2D SDfile   Computed 3D by Vconf -m prep SDfile
Find this compound or compounds like it in BindingDB:
Activity Spreadsheet -- Enzyme Inhibition Constant Data from BindingDB
Found 1 hit for monomerid = 50202809
TargetMalonyl-CoA decarboxylase, mitochondrial(Homo sapiens (Human))
Chugai Pharma Usa
Curated by ChEMBL
LigandPNGBDBM50202809(CHEMBL247462 | N-(cyclopropylmethyl)-N-propyl-4-(2...)
Affinity DataIC50:  68nM. Assay description: Inhibition of MBP fused human MCD
In DepthDetails ArticlePubMed