BDBM50203053 1-(4-(piperidin-1-ylmethyl)phenethyl)-4-(2-(4-trifluoromethylphenyl)acetyl) piperazin-2-one::CHEMBL228294
SMILES Fc1ccc(CC(=O)N2CCN(CCc3ccc(CN4CCCCC4)cc3)C(=O)C2)cc1
InChI Key InChIKey=RFOCUEPFSOBNJM-UHFFFAOYSA-N
Data  1 KI  1 IC50
  Tab Delimited (TSV)   2D SDfile   Computed 3D by Vconf -m prep SDfile
Find this compound or compounds like it in BindingDB:
Activity Spreadsheet -- Enzyme Inhibition Constant Data from BindingDB
Found 2 hits for monomerid = 50203053
TargetMelanin-concentrating hormone receptor 1(Homo sapiens (Human))
Procter & Gamble Pharmaceuticals
Curated by ChEMBL
LigandPNGBDBM50203053(1-(4-(piperidin-1-ylmethyl)phenethyl)-4-(2-(4-trif...)
Affinity DataKi:  1.20E+3nM. Assay description: Binding affinity at MCHR1 by flash plate radioligand binding assay
In DepthDetails ArticlePubMed
TargetMelanin-concentrating hormone receptor 1(Homo sapiens (Human))
Procter & Gamble Pharmaceuticals
Curated by ChEMBL
LigandPNGBDBM50203053(1-(4-(piperidin-1-ylmethyl)phenethyl)-4-(2-(4-trif...)
Affinity DataIC50:  3.70E+3nM. Assay description: Binding affinity at MCHR1 by flash plate radioligand binding assay
In DepthDetails ArticlePubMed