BDBM50203229 CHEMBL3980903
SMILES Cn1cc(-c2c(N)nc(N)nc2C2CC2)c2ccccc12
InChI Key InChIKey=YXHFJTDWWPFAGS-UHFFFAOYSA-N
Data  2 IC50
  Tab Delimited (TSV)   2D SDfile   Computed 3D by Vconf -m prep SDfile
Find this compound or compounds like it in BindingDB:
Activity Spreadsheet -- Enzyme Inhibition Constant Data from BindingDB
Found 2 hits for monomerid = 50203229
TargetBifunctional dihydrofolate reductase-thymidylate synthase(Toxoplasma gondii)
Turing Pharmaceuticals
Curated by ChEMBL
LigandPNGBDBM50203229(CHEMBL3980903)
Affinity DataIC50:  460nM. Assay description: Inhibition of Toxoplasma gondii TS-DHFR expressed in Escherichia coli BL21 preincubated for 15 mins followed by addition of DHF as substrate and NADP...
In DepthDetails ArticlePubMed
TargetDihydrofolate reductase(Homo sapiens (Human))
Turing Pharmaceuticals
Curated by ChEMBL
LigandPNGBDBM50203229(CHEMBL3980903)
Affinity DataIC50:  2.80E+3nM. Assay description: Inhibition of recombinant human DHFR expressed in Escherichia coli preincubated for 15 mins followed by addition of DHF as substrate and NADPH measur...
In DepthDetails ArticlePubMed