BDBM50203650 CHEMBL3940493
SMILES OC(=O)CCCOc1ccc(cc1)-c1ccccc1Oc1ccccc1
InChI Key InChIKey=RRKJCHFRHOQLNR-UHFFFAOYSA-N
Data  3 EC50
  Tab Delimited (TSV)   2D SDfile   Computed 3D by Vconf -m prep SDfile
Find this compound or compounds like it in BindingDB:
Activity Spreadsheet -- Enzyme Inhibition Constant Data from BindingDB
Found 3 hits for monomerid = 50203650
TargetFree fatty acid receptor 1(Homo sapiens (Human))
Merck
Curated by ChEMBL
LigandPNGBDBM50203650(CHEMBL3940493)
Affinity DataEC50: >9.95E+3nM. Assay description: Agonist activity at human GPR40 measured after 60 mins by IP1-HTRF assay
In DepthDetails ArticlePubMed
TargetFree fatty acid receptor 4(Homo sapiens (Human))
Merck
Curated by ChEMBL
LigandPNGBDBM50203650(CHEMBL3940493)
Affinity DataEC50:  546nM. Assay description: Agonist activity at human GPR120 expressed in CHOK1 cells measured after 60 mins by IP1-HTRF assay
In DepthDetails ArticlePubMed
TargetFree fatty acid receptor 4(Mus musculus)
Merck
Curated by ChEMBL
LigandPNGBDBM50203650(CHEMBL3940493)
Affinity DataEC50:  418nM. Assay description: Agonist activity at mouse GPR120 expressed in CHOK1 cells measured after 60 mins by IP1-HTRF assay
In DepthDetails ArticlePubMed