BDBM50203670 CHEMBL3985509
SMILES OC(=O)CCCOc1ccc(cc1)-c1cc(Oc2ccccc2)ccc1F
InChI Key InChIKey=ZSQHPVMBVGKLJL-UHFFFAOYSA-N
Data  3 EC50
  Tab Delimited (TSV)   2D SDfile   Computed 3D by Vconf -m prep SDfile
Find this compound or compounds like it in BindingDB:
Activity Spreadsheet -- Enzyme Inhibition Constant Data from BindingDB
Found 3 hits for monomerid = 50203670
TargetFree fatty acid receptor 4(Mus musculus)
Merck
Curated by ChEMBL
LigandPNGBDBM50203670(CHEMBL3985509)
Affinity DataEC50:  29nM. Assay description: Agonist activity at mouse GPR120 expressed in CHOK1 cells measured after 60 mins by IP1-HTRF assay
In DepthDetails ArticlePubMed
TargetFree fatty acid receptor 4(Homo sapiens (Human))
Merck
Curated by ChEMBL
LigandPNGBDBM50203670(CHEMBL3985509)
Affinity DataEC50:  100nM. Assay description: Agonist activity at human GPR120 expressed in CHOK1 cells measured after 60 mins by IP1-HTRF assay
In DepthDetails ArticlePubMed
TargetFree fatty acid receptor 1(Homo sapiens (Human))
Merck
Curated by ChEMBL
LigandPNGBDBM50203670(CHEMBL3985509)
Affinity DataEC50:  3.59E+3nM. Assay description: Agonist activity at human GPR40 measured after 60 mins by IP1-HTRF assay
In DepthDetails ArticlePubMed