BDBM50203821 CHEMBL374749::biphenyl-4-carboxylic acid {4-[4-(2-chloro-phenyl)-piperazin-1-yl]-butyl}-amide
SMILES Clc1ccccc1N1CCN(CCCCNC(=O)c2ccc(cc2)-c2ccccc2)CC1
InChI Key InChIKey=GKYCMCAEMPRKBH-UHFFFAOYSA-N
Data  1 KI
  Tab Delimited (TSV)   2D SDfile   Computed 3D by Vconf -m prep SDfile
Find this compound or compounds like it in BindingDB:
Activity Spreadsheet -- Enzyme Inhibition Constant Data from BindingDB
Found 1 hit for monomerid = 50203821
TargetD(3) dopamine receptor(Homo sapiens (Human))
Friedrich-Alexander University
Curated by ChEMBL
LigandPNGBDBM50203821(CHEMBL374749 | biphenyl-4-carboxylic acid {4-[4-(2...)
Affinity DataKi:  0.280nM. Assay description: Displacement of [3H]spiperone from human dopamine D3 expressed in CHO cell membrane
In DepthDetails ArticlePubMed