BDBM50204574 3-((1E,17E)-2-(6-((E)-3,4-dihydroxystyryl)-4-hydroxy-2-oxo-2H-pyran-3-yl)-4,5-dihydroxystyryl)-8,9-dihydroxypyrano[4,3-c]isochromene-1,6-dione::8,9-dihydroxy-3-{6,7-dihydroxy-4-(hispidin-3-yl)styryl}pyrano[4,3-c]isochromen-4-one::CHEMBL221760
SMILES Oc1ccc(\C=C\c2cc(O)c(-c3cc(O)c(O)cc3\C=C\c3cc4oc(=O)c5cc(O)c(O)cc5c4c(=O)o3)c(=O)o2)cc1O
InChI Key InChIKey=ZNLSHKJBXWCRKW-CLLRDSTBSA-N
Data  1 IC50
  Tab Delimited (TSV)   2D SDfile   Computed 3D by Vconf -m prep SDfile
Find this compound or compounds like it in BindingDB:
Activity Spreadsheet -- Enzyme Inhibition Constant Data from BindingDB
Found 1 hit for monomerid = 50204574
TargetTyrosine-protein phosphatase non-receptor type 1(Homo sapiens (Human))
Chinese Academy Of Medical Sciences And Peking Union Medical College
Curated by ChEMBL
LigandPNGBDBM50204574(3-((1E,17E)-2-(6-((E)-3,4-dihydroxystyryl)-4-hydro...)
Affinity DataIC50:  3.00E+3nM. Assay description: Inhibition of human PTP1B
In DepthDetails ArticlePubMed