BDBM50204889 CHEMBL222457::N-[2-(4-benzyl-piperidine-1-carbonyl)-1H-indol-5yl]-methanesulfonamide
SMILES CS(=O)(=O)Nc1ccc2[nH]c(cc2c1)C(=O)N1CCC(Cc2ccccc2)CC1
InChI Key InChIKey=GPVBQLNDQYZKGQ-UHFFFAOYSA-N
Data  2 IC50
  Tab Delimited (TSV)   2D SDfile   Computed 3D by Vconf -m prep SDfile
Find this compound or compounds like it in BindingDB:
Activity Spreadsheet -- Enzyme Inhibition Constant Data from BindingDB
Found 2 hits for monomerid = 50204889
TargetGlutamate receptor ionotropic, NMDA 2B(Rattus norvegicus (Rat))
Gedeon Richter
Curated by ChEMBL
LigandPNGBDBM50204889(CHEMBL222457 | N-[2-(4-benzyl-piperidine-1-carbony...)
Affinity DataIC50:  631nM. Assay description: Antagonist activity at NR2B NMDA receptor in Wistar rat neocortical cells assessed as inhibition of NMDA-evoked elevation of intracellular calcium co...
In DepthDetails ArticlePubMed
TargetGlutamate receptor ionotropic, NMDA 2B(Rattus norvegicus (Rat))
Gedeon Richter
Curated by ChEMBL
LigandPNGBDBM50204889(CHEMBL222457 | N-[2-(4-benzyl-piperidine-1-carbony...)
Affinity DataIC50:  1.55E+3nM. Assay description: Displacement of [3H]Ro 25,6981 from NR2B NMDA receptor in rat forebrain
In DepthDetails ArticlePubMed