BDBM50204890 (6-hydroxy-1H-indole-2-yl)-[3-(4-methoxybenzyl)piperidine-1-yl)]-methanone::CHEMBL220440
SMILES COc1ccc(CC2CCCN(C2)C(=O)c2cc3ccc(O)cc3[nH]2)cc1
InChI Key InChIKey=HWSVQGNWKMDVKH-UHFFFAOYSA-N
Data  1 IC50
  Tab Delimited (TSV)   2D SDfile   Computed 3D by Vconf -m prep SDfile
Find this compound or compounds like it in BindingDB:
Activity Spreadsheet -- Enzyme Inhibition Constant Data from BindingDB
Found 1 hit for monomerid = 50204890
TargetGlutamate receptor ionotropic, NMDA 2B(Rattus norvegicus (Rat))
Gedeon Richter
Curated by ChEMBL
LigandPNGBDBM50204890((6-hydroxy-1H-indole-2-yl)-[3-(4-methoxybenzyl)pip...)
Affinity DataIC50:  2.21E+3nM. Assay description: Antagonist activity at NR2B NMDA receptor in Wistar rat neocortical cells assessed as inhibition of NMDA-evoked elevation of intracellular calcium co...
In DepthDetails ArticlePubMed