BDBM50204960 3-(4-{4-acetylamino-5-[1-phenyl-meth-(E)-ylidene-hydrazinocarbonylmethylsulfanyl]-4H-[1,2,4]triazol-3-ylmethyl}-thiazol-2-ylamino)-propionic acid::CHEMBL232913
SMILES CC(=O)Nn1c(Cc2csc(NCCC(O)=O)n2)nnc1SCC(=O)NN=Cc1ccccc1
InChI Key InChIKey=KKERJEDNLKDSOA-UHFFFAOYSA-N
Data  1 IC50
  Tab Delimited (TSV)   2D SDfile   Computed 3D by Vconf -m prep SDfile
Find this compound or compounds like it in BindingDB:
Activity Spreadsheet -- Enzyme Inhibition Constant Data from BindingDB
Found 1 hit for monomerid = 50204960
TargetCyclin-dependent kinase 5 activator 1(Homo sapiens (Human))
Dr. Reddys Laboratories
Curated by ChEMBL
LigandPNGBDBM50204960(3-(4-{4-acetylamino-5-[1-phenyl-meth-(E)-ylidene-h...)
Affinity DataIC50:  635nM. Assay description: Inhibition of human cdk5/p25 by SPA
In DepthDetails ArticlePubMed