BDBM50205000 3-(4-((4-acetamido-5-((4-amino-5-mercapto-4H-1,2,4-triazol-3-yl)methylthio)-4H-1,2,4-triazol-3-yl)methyl)thiazol-2-ylamino)propanoic acid::CHEMBL233122
SMILES CC(=O)Nn1c(Cc2csc(NCCC(O)=O)n2)nnc1SCc1n[nH]c(=S)n1N
InChI Key InChIKey=WBZRMLHCZOMCHV-UHFFFAOYSA-N
Data  1 IC50
  Tab Delimited (TSV)   2D SDfile   Computed 3D by Vconf -m prep SDfile
Find this compound or compounds like it in BindingDB:
Activity Spreadsheet -- Enzyme Inhibition Constant Data from BindingDB
Found 1 hit for monomerid = 50205000
TargetCyclin-dependent kinase 5 activator 1(Homo sapiens (Human))
Dr. Reddys Laboratories
Curated by ChEMBL
LigandPNGBDBM50205000(3-(4-((4-acetamido-5-((4-amino-5-mercapto-4H-1,2,4...)
Affinity DataIC50:  6.41E+3nM. Assay description: Inhibition of human cdk5/p25 by SPA
In DepthDetails ArticlePubMed