BDBM50205002 CHEMBL399828::N-(3-((2-acetamidothiazol-4-yl)methyl)-5-(cyanomethylthio)-4H-1,2,4-triazol-4-yl)-4-chlorobenzamide::N-{3-({2-[(acetyl)amino]-1,3-thiazol-4-yl}methyl)-5-[(cyanomethyl)sulfanyl]-4H-1,2,4-triazol-4-yl}-4-chlorobenzamide
SMILES CC(=O)Nc1nc(Cc2nnc(SCC#N)n2NC(=O)c2ccc(Cl)cc2)cs1
InChI Key InChIKey=GRMBHDGZBLMPSZ-UHFFFAOYSA-N
Data  2 IC50
  Tab Delimited (TSV)   2D SDfile   Computed 3D by Vconf -m prep SDfile
Find this compound or compounds like it in BindingDB:
Activity Spreadsheet -- Enzyme Inhibition Constant Data from BindingDB
Found 2 hits for monomerid = 50205002
TargetCyclin-dependent kinase 5 activator 1(Homo sapiens (Human))
Dr. Reddys Laboratories
Curated by ChEMBL
LigandPNGBDBM50205002(CHEMBL399828 | N-(3-((2-acetamidothiazol-4-yl)meth...)
Affinity DataIC50:  62nM. Assay description: Inhibition of human cdk5/p25 by SPA
In DepthDetails ArticlePubMed
TargetCyclin-dependent kinase 2/G1/S-specific cyclin-E1/G1/S-specific cyclin-E2(Homo sapiens (Human))
Dr. Reddys Laboratories
Curated by ChEMBL
LigandPNGBDBM50205002(CHEMBL399828 | N-(3-((2-acetamidothiazol-4-yl)meth...)
Affinity DataIC50:  1.14E+3nM. Assay description: Inhibition of human cdk2/cyclin E by SPA
In DepthDetails ArticlePubMed