BDBM50205018 CHEMBL234556::N-[3-[2-(N'-acetyl-hydrazino)-2-oxo-ethylsulfanyl]-5-(2-benzoylamino-thiazol-4-ylmethyl)-[1,2,4]triazol-4-yl]-4-chloro-benzamide
SMILES CC(=O)NNC(=O)CSc1nnc(Cc2csc(NC(=O)c3ccccc3)n2)n1NC(=O)c1ccc(Cl)cc1
InChI Key InChIKey=OYRGDRUYBZTRNH-UHFFFAOYSA-N
Data  1 IC50
  Tab Delimited (TSV)   2D SDfile   Computed 3D by Vconf -m prep SDfile
Find this compound or compounds like it in BindingDB:
Activity Spreadsheet -- Enzyme Inhibition Constant Data from BindingDB
Found 1 hit for monomerid = 50205018
TargetCyclin-dependent kinase 5 activator 1(Homo sapiens (Human))
Dr. Reddys Laboratories
Curated by ChEMBL
LigandPNGBDBM50205018(CHEMBL234556 | N-[3-[2-(N'-acetyl-hydrazino)-2-oxo...)
Affinity DataIC50:  340nM. Assay description: Inhibition of human cdk5/p25 by SPA
In DepthDetails ArticlePubMed