BDBM50205039 CHEMBL399387::methyl 2-(5-((2-benzamidothiazol-4-yl)methyl)-4-(4-chlorobenzamido)-4H-1,2,4-triazol-3-ylthio)acetate::methyl{[4-(benzoylamino)-5-({2-[(benzoyl)amino]-1,3-thiazol-4-yl}methyl)-4H-1,2,4-triazol-3-yl]sulfanyl}acetate
SMILES COC(=O)CSc1nnc(Cc2csc(NC(=O)c3ccccc3)n2)n1NC(=O)c1ccc(Cl)cc1
InChI Key InChIKey=AGGOMTQTYXFXQA-UHFFFAOYSA-N
Data  1 IC50
  Tab Delimited (TSV)   2D SDfile   Computed 3D by Vconf -m prep SDfile
Find this compound or compounds like it in BindingDB:
Activity Spreadsheet -- Enzyme Inhibition Constant Data from BindingDB
Found 1 hit for monomerid = 50205039
TargetCyclin-dependent kinase 5 activator 1(Homo sapiens (Human))
Dr. Reddys Laboratories
Curated by ChEMBL
LigandPNGBDBM50205039(CHEMBL399387 | methyl 2-(5-((2-benzamidothiazol-4-...)
Affinity DataIC50:  290nM. Assay description: Inhibition of human cdk5/p25 by SPA
In DepthDetails ArticlePubMed