BDBM50205045 CHEMBL243439::N-[3-{[2-(2-chloroacetylhydrazino)-2-oxoethyl]sulfanyl}-5-({2-[(benzoyl)amino]-1,3-thiazol-4-yl}methyl)-4H-1,2,4-triazol-4-yl]benzamide
SMILES ClCC(=O)NNC(=O)CSc1nnc(Cc2csc(NC(=O)c3ccccc3)n2)n1NC(=O)c1ccccc1
InChI Key InChIKey=CZANBJDHIJIHIW-UHFFFAOYSA-N
Data  1 IC50
  Tab Delimited (TSV)   2D SDfile   Computed 3D by Vconf -m prep SDfile
Find this compound or compounds like it in BindingDB:
Activity Spreadsheet -- Enzyme Inhibition Constant Data from BindingDB
Found 1 hit for monomerid = 50205045
TargetCyclin-dependent kinase 5 activator 1(Homo sapiens (Human))
Dr. Reddys Laboratories
Curated by ChEMBL
LigandPNGBDBM50205045(CHEMBL243439 | N-[3-{[2-(2-chloroacetylhydrazino)-...)
Affinity DataIC50:  542nM. Assay description: Inhibition of human cdk5/p25 by SPA
In DepthDetails ArticlePubMed