BDBM50205117 2-hydroxy-4-((7R,7aS)-7-hydroxy-1,3-dioxo-tetrahydro-1H-pyrrolo[1,2-e]imidazol-2(3H)-yl)-3-methylbenzonitrile::CHEMBL389805
SMILES Cc1c(O)c(ccc1-n1c(O)c2[C@H](O)CCn2c1=O)C#N
InChI Key InChIKey=XEEMXKFCLVLQTD-SNVBAGLBSA-N
Data  1 EC50
  Tab Delimited (TSV)   2D SDfile   Computed 3D by Vconf -m prep SDfile
Find this compound or compounds like it in BindingDB:
Activity Spreadsheet -- Enzyme Inhibition Constant Data from BindingDB
Found 1 hit for monomerid = 50205117
TargetAndrogen receptor(Homo sapiens (Human))
Pharmaceutical Research Institute
Curated by ChEMBL
LigandPNGBDBM50205117(2-hydroxy-4-((7R,7aS)-7-hydroxy-1,3-dioxo-tetrahyd...)
Affinity DataEC50: >1.00E+4nM. Assay description: Agonist activity at human AR
In DepthDetails ArticlePubMed