BDBM50205299 CHEMBL375187::d[Cha4,Dap8]VP
SMILES NC[C@H](NC(=O)[C@@H]1CCCN1C(=O)[C@@H]1CSSCCC(=O)N[C@@H](Cc2ccc(O)cc2)C(=O)N[C@@H](Cc2ccccc2)C(=O)N[C@@H](CC2CCCCC2)C(=O)N[C@@H](CC(N)=O)C(=O)N1)C(=O)NCC(N)=O
InChI Key InChIKey=XABCPBOFMBSCDK-PEAOEFARSA-N
Data  4 KI  1 Kd
  Tab Delimited (TSV)   2D SDfile   Computed 3D by Vconf -m prep SDfile
Find this compound or compounds like it in BindingDB:
Activity Spreadsheet -- Enzyme Inhibition Constant Data from BindingDB
Found 5 hits for monomerid = 50205299
TargetVasopressin V1b receptor(RAT)
University Of Montpellier
Curated by ChEMBL
LigandPNGBDBM50205299(CHEMBL375187 | d[Cha4,Dap8]VP)
Affinity DataKi:  10nM. Assay description: Displacement of [3H]AVP from rat vasopressin V1b receptor expressed in At-T20 cells
In DepthDetails ArticlePubMed
TargetVasopressin V2 receptor(Rattus norvegicus (Rat))
University Of Montpellier
Curated by ChEMBL
LigandPNGBDBM50205299(CHEMBL375187 | d[Cha4,Dap8]VP)
Affinity DataKi:  1.05E+3nM. Assay description: Displacement of [3H]AVP from vasopressin V2 receptor in rat kidney membranes
In DepthDetails ArticlePubMed
TargetOxytocin receptor(RAT)
University Of Montpellier
Curated by ChEMBL
LigandPNGBDBM50205299(CHEMBL375187 | d[Cha4,Dap8]VP)
Affinity DataKi:  1.20E+3nM. Assay description: Displacement of [3H]AVP from rat OT receptor expressed in CHO cells
In DepthDetails ArticlePubMed
TargetVasopressin V1a receptor(RAT)
University Of Montpellier
Curated by ChEMBL
LigandPNGBDBM50205299(CHEMBL375187 | d[Cha4,Dap8]VP)
Affinity DataKi:  1.80E+3nM. Assay description: Displacement of [3H]AVP from vasopressin V1a receptor in rat liver membrane
In DepthDetails ArticlePubMed
TargetOxytocin receptor(Homo sapiens (Human))
University Of Montpellier
Curated by ChEMBL
LigandPNGBDBM50205299(CHEMBL375187 | d[Cha4,Dap8]VP)
Affinity DataKd:  479nM. Assay description: Activity at OT receptor assessed as oxytocic activity in absence of magnesium
In DepthDetails ArticlePubMed