BDBM50205330 CHEMBL3973099
SMILES OC(=O)C(O)=O.CN(Cc1cccc(c1)-c1cccc(Cl)c1)C(=O)CN
InChI Key InChIKey=JKLAXYAZJFQJRG-UHFFFAOYSA-N
Data  1 IC50
  Tab Delimited (TSV)   2D SDfile   Computed 3D by Vconf -m prep SDfile
Find this compound or compounds like it in BindingDB:
Activity Spreadsheet -- Enzyme Inhibition Constant Data from BindingDB
Found 1 hit for monomerid = 50205330
TargetMembrane primary amine oxidase(Homo sapiens (Human))
Astellas Pharma
Curated by ChEMBL
LigandPNGBDBM50205330(CHEMBL3973099)
Affinity DataIC50:  1.30E+3nM. Assay description: Inhibition of human VAP-1 expressed in CHO cells using 14C-benzylamine as substrate preincubated for 20 mins followed by substrate addition measured ...
In DepthDetails ArticlePubMed