BDBM50205380 3-[3-(3,4,5-trihydroxy-phenyl)-propionylamino]-benzoic acid::CHEMBL220338
SMILES OC(=O)c1cccc(NC(=O)CCc2cc(O)c(O)c(O)c2)c1
InChI Key InChIKey=SIPFYLFVHRBZAL-UHFFFAOYSA-N
Data  3 IC50
  Tab Delimited (TSV)   2D SDfile   Computed 3D by Vconf -m prep SDfile
Find this compound or compounds like it in BindingDB:
Activity Spreadsheet -- Enzyme Inhibition Constant Data from BindingDB
Found 3 hits for monomerid = 50205380
TargetL-selectin(Homo sapiens (Human))
Revotar Biopharmaceuticals
Curated by ChEMBL
LigandPNGBDBM50205380(3-[3-(3,4,5-trihydroxy-phenyl)-propionylamino]-ben...)
Affinity DataIC50:  4.66E+4nM. Assay description: Inhibition of human L-selectin after 2 hrs
In DepthDetails ArticlePubMed
TargetP-selectin(Homo sapiens (Human))
Revotar Biopharmaceuticals
Curated by ChEMBL
LigandPNGBDBM50205380(3-[3-(3,4,5-trihydroxy-phenyl)-propionylamino]-ben...)
Affinity DataIC50:  1.96E+4nM. Assay description: Inhibition of human P-selectin after 2 hrs
In DepthDetails ArticlePubMed
TargetE-selectin(Homo sapiens (Human))
Revotar Biopharmaceuticals
Curated by ChEMBL
LigandPNGBDBM50205380(3-[3-(3,4,5-trihydroxy-phenyl)-propionylamino]-ben...)
Affinity DataIC50:  1.87E+4nM. Assay description: Inhibition of human E-selectin after 2 hrs
In DepthDetails ArticlePubMed