BDBM50205936 CHEMBL374552::N-[(1,3-benzodioxol-5-yl)methyl]-1-[4-(1H-imidazol-1-yl)-6-pyrimidinyl]-2-piperidineacetamide
SMILES O=C(CC1CCCCN1c1cc(ncn1)-n1ccnc1)NCc1ccc2OCOc2c1
InChI Key InChIKey=XLIZPIPYSZBNFC-UHFFFAOYSA-N
Data  1 IC50
  Tab Delimited (TSV)   2D SDfile   Computed 3D by Vconf -m prep SDfile
Find this compound or compounds like it in BindingDB:
Activity Spreadsheet -- Enzyme Inhibition Constant Data from BindingDB
Found 1 hit for monomerid = 50205936
TargetNitric oxide synthase, inducible(Homo sapiens (Human))
Berlex Biosciences
Curated by ChEMBL
LigandPNGBDBM50205936(CHEMBL374552 | N-[(1,3-benzodioxol-5-yl)methyl]-1-...)
Affinity DataIC50:  10nM. Assay description: Inhibition of cytokine-induced iNOS expressed in human A172 cells assessed as inhibition of NO formation
In DepthDetails ArticlePubMed