BDBM50205997 CHEMBL395290::[Pip7]OT
SMILES CC[C@H](C)[C@@H]1NC(=O)[C@H](Cc2ccc(O)cc2)NC(=O)[C@@H](N)CSSC[C@H](NC(=O)[C@H](CC(N)=O)NC(=O)[C@H](CCC(N)=O)NC1=O)C(=O)N1CCCC[C@H]1C(=O)N[C@@H](CC(C)C)C(=O)NCC(N)=O
InChI Key InChIKey=AEGMQTAGVURKHK-KSHLYWJDSA-N
Data  1 IC50
  Tab Delimited (TSV)   2D SDfile   Computed 3D by Vconf -m prep SDfile
Find this compound or compounds like it in BindingDB:
Activity Spreadsheet -- Enzyme Inhibition Constant Data from BindingDB
Found 1 hit for monomerid = 50205997
TargetOxytocin receptor(Homo sapiens (Human))
University Of Patras
Curated by ChEMBL
LigandPNGBDBM50205997(CHEMBL395290 | [Pip7]OT)
Affinity DataIC50:  7nM. Assay description: Displacement of [3H]OT from human OT receptor expressed in HEK cells
In DepthDetails ArticlePubMed