BDBM50206325 CHEMBL3905738
SMILES CC(=O)N[C@@H]1[C@@H](NC(=N)NC(=O)CCn2cc(nn2)-c2ccccc2)C=C(OC1[C@H](O)[C@H](O)CO)C(O)=O
InChI Key InChIKey=PZFKGKBFTVLVOP-PIEVHNJWSA-N
Data  1 IC50
  Tab Delimited (TSV)   2D SDfile   Computed 3D by Vconf -m prep SDfile
Find this compound or compounds like it in BindingDB:
Activity Spreadsheet -- Enzyme Inhibition Constant Data from BindingDB
Found 1 hit for monomerid = 50206325
TargetNeuraminidase(Influenza A virus (strain A/Wilson-Smith/1933 H1N1...)
National Tsing Hua University
Curated by ChEMBL
LigandPNGBDBM50206325(CHEMBL3905738)
Affinity DataIC50:  146nM. Assay description: Competitive inhibition of MDCK infected Influenza A virus A/WSN/33(H1N1) neuraminidase using MU-NANA as substrate preincubated for 30 mins followed b...
In DepthDetails ArticlePubMed