BDBM50206400 CHEMBL247945::N-((S)-1-amino-3-(4-hydroxyphenyl)-1-oxopropan-2-yl)-3-(1-(4-tert-butylphenyl)-3-(isoquinolin-3-yl)-1H-pyrazol-5-yl)benzamide
SMILES CC(C)(C)c1ccc(cc1)-n1nc(cc1-c1cccc(c1)C(=O)N[C@@H](Cc1ccc(O)cc1)C(N)=O)-c1cc2ccccc2cn1
InChI Key InChIKey=KEUNWJNSNZWHBS-UMSFTDKQSA-N
Data  1 EC50
  Tab Delimited (TSV)   2D SDfile   Computed 3D by Vconf -m prep SDfile
Find this compound or compounds like it in BindingDB:
Activity Spreadsheet -- Enzyme Inhibition Constant Data from BindingDB
Found 1 hit for monomerid = 50206400
TargetLutropin-choriogonadotropic hormone receptor(Homo sapiens (Human))
Merck Serono
Curated by ChEMBL
LigandPNGBDBM50206400(CHEMBL247945 | N-((S)-1-amino-3-(4-hydroxyphenyl)-...)
Affinity DataEC50:  500nM. Assay description: Agonist activity at human LH receptor expressed in CHO cells assessed as production of cAMP after 60 mins by SPA
In DepthDetails ArticlePubMed