BDBM50206420 4-(4-fluorophenyl)-3-pyridin-4-ylquinoline-2(1H)-one::CHEMBL221164
SMILES Fc1ccc(cc1)-c1c(-c2ccncc2)c(=O)[nH]c2ccccc12
InChI Key InChIKey=BCPJXIHLEGELNA-UHFFFAOYSA-N
Data  2 IC50
  Tab Delimited (TSV)   2D SDfile   Computed 3D by Vconf -m prep SDfile
Find this compound or compounds like it in BindingDB:
Activity Spreadsheet -- Enzyme Inhibition Constant Data from BindingDB
Found 2 hits for monomerid = 50206420
TargetMitogen-activated protein kinase 10(Homo sapiens (Human))
Eberhard-Karls-University TüBingen
Curated by ChEMBL
LigandPNGBDBM50206420(4-(4-fluorophenyl)-3-pyridin-4-ylquinoline-2(1H)-o...)
Affinity DataIC50: >1.00E+4nM. Assay description: Inhibition of JNK3 by non-radioactive immunosorbent assay
In DepthDetails ArticlePubMed
TargetMitogen-activated protein kinase 14(Homo sapiens (Human))
Eberhard-Karls-University TüBingen
Curated by ChEMBL
LigandPNGBDBM50206420(4-(4-fluorophenyl)-3-pyridin-4-ylquinoline-2(1H)-o...)
Affinity DataIC50: >1.00E+4nM. Assay description: Inhibition of p38alpha MAPK by non-radioactive immunosorbent assay
In DepthDetails ArticlePubMed