BDBM50206465 CHEMBL3957420
SMILES COc1cc(\C=C2/S\C(=N/c3ccccc3)N(Cc3ccco3)C2=O)cc(OC)c1OC
InChI Key InChIKey=XVKWEMAKBGDFSO-TUIQHYKLSA-N
Data  1 KI
  Tab Delimited (TSV)   2D SDfile   Computed 3D by Vconf -m prep SDfile
Find this compound or compounds like it in BindingDB:
Activity Spreadsheet -- Enzyme Inhibition Constant Data from BindingDB
Found 1 hit for monomerid = 50206465
TargetThioredoxin reductase(Entamoeba histolytica)
Jamia Millia Islamia
Curated by ChEMBL
LigandPNGBDBM50206465(CHEMBL3957420)
Affinity DataKi:  1.05E+3nM. Assay description: Inhibition of Entamoeba histolytica thioredoxin reductase
In DepthDetails ArticlePubMed